Contract ID,Reference IDV,Modification Number,Transaction Number,Award/IDV Type,Action Obligation ($),Date Signed,Solicitation Date,Contracting Agency ID,Contracting Agency,Contracting Office Name,PSC Type,PSC,PSC Description,NAICS,NAICS Description,Entity City,Entity State,Entity ZIP Code,Additional Reporting Code,Additional Reporting Description,Unique Entity ID,Ultimate Parent Unique Entity ID,Ultimate Parent Legal Business Name,Legal Business Name,CAGE Code,
"GSP0116BW7192","GS01P13BZD0013","0","0","DO Delivery Order","$1,482,907.94","May 13, 2016",,"4740","PUBLIC BUILDINGS SERVICE","PBS R1 ACQ MANAGEMENT DIVISION","S","Z2AA","REPAIR OR ALTERATION OF OFFICE BUILDINGS","236220","COMMERCIAL AND INSTITUTIONAL BUILDING CONSTRUCTION","WOBURN","MA","018011092",,,"JYEWBM2PC2J5","JYEWBM2PC2J5","CORNERSTONE CONSTRUCTION SERVICES  LLC","CORNERSTONE CONSTRUCTION SERVICES, LLC",,
"GSP0117BW0029","GS01P13BZD0013","PS07","0","DO Delivery Order","$47,556.89","Mar 19, 2018",,"4740","PUBLIC BUILDINGS SERVICE","PBS R1 ACQ MANAGEMENT DIVISION","S","Z2AA","REPAIR OR ALTERATION OF OFFICE BUILDINGS","236220","COMMERCIAL AND INSTITUTIONAL BUILDING CONSTRUCTION","WOBURN","MA","018011092",,,"JYEWBM2PC2J5","JYEWBM2PC2J5","CORNERSTONE CONSTRUCTION SERVICES  LLC","CORNERSTONE CONSTRUCTION SERVICES, LLC","4XRZ9",
"GSP0117BW0038","GS01P13BZD0013","PS01","0","DO Delivery Order","$4,004.18","Aug 4, 2017",,"4740","PUBLIC BUILDINGS SERVICE","PBS R1 ACQ MANAGEMENT DIVISION","S","Z2AA","REPAIR OR ALTERATION OF OFFICE BUILDINGS","236220","COMMERCIAL AND INSTITUTIONAL BUILDING CONSTRUCTION","WOBURN","MA","018011092",,,"JYEWBM2PC2J5","JYEWBM2PC2J5","CORNERSTONE CONSTRUCTION SERVICES  LLC","CORNERSTONE CONSTRUCTION SERVICES, LLC","4XRZ9",
"GSP0115BZ5015","GS01P13BZD0013","0","0","DO Delivery Order","$45,000.00","Feb 27, 2015",,"4740","PUBLIC BUILDINGS SERVICE","GSA/PBS NEW ENGLAND REGION","S","S218","HOUSEKEEPING- SNOW REMOVAL/SALT","236220","COMMERCIAL AND INSTITUTIONAL BUILDING CONSTRUCTION","WOBURN","MA","018011092",,,"JYEWBM2PC2J5","JYEWBM2PC2J5","CORNERSTONE CONSTRUCTION SERVICES  LLC","CORNERSTONE CONSTRUCTION SERVICES, LLC",,
"GSP0116BW7192","GS01P13BZD0013","PS03","0","DO Delivery Order","$69,840.20","May 26, 2017",,"4740","PUBLIC BUILDINGS SERVICE","PBS R1 ACQ MANAGEMENT DIVISION","S","Z2AA","REPAIR OR ALTERATION OF OFFICE BUILDINGS","236220","COMMERCIAL AND INSTITUTIONAL BUILDING CONSTRUCTION","WOBURN","MA","018011092",,,"JYEWBM2PC2J5","JYEWBM2PC2J5","CORNERSTONE CONSTRUCTION SERVICES  LLC","CORNERSTONE CONSTRUCTION SERVICES, LLC","4XRZ9",
"GSP0117BW0029","GS01P13BZD0013","PA06","0","DO Delivery Order","$0.00","Feb 21, 2018",,"4740","PUBLIC BUILDINGS SERVICE","PBS R1 ACQ MANAGEMENT DIVISION","S","Z2AA","REPAIR OR ALTERATION OF OFFICE BUILDINGS","236220","COMMERCIAL AND INSTITUTIONAL BUILDING CONSTRUCTION","WOBURN","MA","018011092",,,"JYEWBM2PC2J5","JYEWBM2PC2J5","CORNERSTONE CONSTRUCTION SERVICES  LLC","CORNERSTONE CONSTRUCTION SERVICES, LLC","4XRZ9",
"GSP0117BW0029","GS01P13BZD0013","PA16","0","DO Delivery Order","$0.00","Feb 4, 2020",,"4740","PUBLIC BUILDINGS SERVICE","PBS R1 ACQ MANAGEMENT DIVISION","S","Z2AA","REPAIR OR ALTERATION OF OFFICE BUILDINGS","236220","COMMERCIAL AND INSTITUTIONAL BUILDING CONSTRUCTION","WOBURN","MA","018011092",,,"JYEWBM2PC2J5","JYEWBM2PC2J5","CORNERSTONE CONSTRUCTION SERVICES  LLC","CORNERSTONE CONSTRUCTION SERVICES, LLC","4XRZ9",
"GSP0117BW0029","GS01P13BZD0013","PS05","0","DO Delivery Order","$41,000.00","Oct 12, 2017",,"4740","PUBLIC BUILDINGS SERVICE","PBS R1 ACQ MANAGEMENT DIVISION","S","Z2AA","REPAIR OR ALTERATION OF OFFICE BUILDINGS","236220","COMMERCIAL AND INSTITUTIONAL BUILDING CONSTRUCTION","WOBURN","MA","018011092",,,"JYEWBM2PC2J5","JYEWBM2PC2J5","CORNERSTONE CONSTRUCTION SERVICES  LLC","CORNERSTONE CONSTRUCTION SERVICES, LLC","4XRZ9",
"GSP0115BW7096","GS01P13BZD0013","PS04","0","DO Delivery Order","$2,583.91","Feb 3, 2016",,"4740","PUBLIC BUILDINGS SERVICE","GSA/PBS NEW ENGLAND REGION","S","Z2AA","REPAIR OR ALTERATION OF OFFICE BUILDINGS","236220","COMMERCIAL AND INSTITUTIONAL BUILDING CONSTRUCTION","WOBURN","MA","018011092",,,"JYEWBM2PC2J5","JYEWBM2PC2J5","CORNERSTONE CONSTRUCTION SERVICES  LLC","CORNERSTONE CONSTRUCTION SERVICES, LLC",,
"GSP0115BW7007","GS01P13BZD0013","0","0","DO Delivery Order","$88,225.00","Jun 30, 2015",,"4740","PUBLIC BUILDINGS SERVICE","GSA/PBS NEW ENGLAND REGION","S","Z2AA","REPAIR OR ALTERATION OF OFFICE BUILDINGS","236220","COMMERCIAL AND INSTITUTIONAL BUILDING CONSTRUCTION","WOBURN","MA","018011092",,,"JYEWBM2PC2J5","JYEWBM2PC2J5","CORNERSTONE CONSTRUCTION SERVICES  LLC","CORNERSTONE CONSTRUCTION SERVICES, LLC",,
"GSP0117BW0029","GS01P13BZD0013","PA13","0","DO Delivery Order","$0.00","Aug 29, 2019",,"4740","PUBLIC BUILDINGS SERVICE","PBS R1 ACQ MANAGEMENT DIVISION","S","Z2AA","REPAIR OR ALTERATION OF OFFICE BUILDINGS","236220","COMMERCIAL AND INSTITUTIONAL BUILDING CONSTRUCTION","WOBURN","MA","018011092",,,"JYEWBM2PC2J5","JYEWBM2PC2J5","CORNERSTONE CONSTRUCTION SERVICES  LLC","CORNERSTONE CONSTRUCTION SERVICES, LLC","4XRZ9",
"GSP0117BW0029","GS01P13BZD0013","PS15","0","DO Delivery Order","$25,000.00","Jan 29, 2020",,"4740","PUBLIC BUILDINGS SERVICE","PBS R1 ACQ MANAGEMENT DIVISION","S","Z2AA","REPAIR OR ALTERATION OF OFFICE BUILDINGS","236220","COMMERCIAL AND INSTITUTIONAL BUILDING CONSTRUCTION","WOBURN","MA","018011092",,,"JYEWBM2PC2J5","JYEWBM2PC2J5","CORNERSTONE CONSTRUCTION SERVICES  LLC","CORNERSTONE CONSTRUCTION SERVICES, LLC","4XRZ9",
"GSP0115BW7096","GS01P13BZD0013","PS06","0","DO Delivery Order","$0.00","Mar 22, 2016",,"4740","PUBLIC BUILDINGS SERVICE","GSA/PBS NEW ENGLAND REGION","S","Z2AA","REPAIR OR ALTERATION OF OFFICE BUILDINGS","236220","COMMERCIAL AND INSTITUTIONAL BUILDING CONSTRUCTION","WOBURN","MA","018011092",,,"JYEWBM2PC2J5","JYEWBM2PC2J5","CORNERSTONE CONSTRUCTION SERVICES  LLC","CORNERSTONE CONSTRUCTION SERVICES, LLC",,
"GSP0116BW7192","GS01P13BZD0013","PO05","0","DO Delivery Order","$0.00","Jul 7, 2017",,"4740","PUBLIC BUILDINGS SERVICE","PBS R1 ACQ MANAGEMENT DIVISION","S","Z2AA","REPAIR OR ALTERATION OF OFFICE BUILDINGS","236220","COMMERCIAL AND INSTITUTIONAL BUILDING CONSTRUCTION","WOBURN","MA","018011092",,,"JYEWBM2PC2J5","JYEWBM2PC2J5","CORNERSTONE CONSTRUCTION SERVICES  LLC","CORNERSTONE CONSTRUCTION SERVICES, LLC","4XRZ9",
"GSP0116BW7192","GS01P13BZD0013","PS07","0","DO Delivery Order","$0.00","May 31, 2018",,"4740","PUBLIC BUILDINGS SERVICE","PBS R1 ACQ MANAGEMENT DIVISION","S","Z2AA","REPAIR OR ALTERATION OF OFFICE BUILDINGS","236220","COMMERCIAL AND INSTITUTIONAL BUILDING CONSTRUCTION","WOBURN","MA","018011092",,,"JYEWBM2PC2J5","JYEWBM2PC2J5","CORNERSTONE CONSTRUCTION SERVICES  LLC","CORNERSTONE CONSTRUCTION SERVICES, LLC","4XRZ9",
"GS01P13BZD0013",,"PO08",0,"IDC Indefinite Delivery Contract","$0.00","Jun 8, 2017",,"4740","PUBLIC BUILDINGS SERVICE","PBS R1 ACQ MANAGEMENT DIVISION","S","Z2AA","REPAIR OR ALTERATION OF OFFICE BUILDINGS","236220","COMMERCIAL AND INSTITUTIONAL BUILDING CONSTRUCTION","WOBURN","MA","018011092",,,"JYEWBM2PC2J5","JYEWBM2PC2J5","CORNERSTONE CONSTRUCTION SERVICES  LLC","CORNERSTONE CONSTRUCTION SERVICES, LLC","4XRZ9",
"GSP0116BW7192","GS01P13BZD0013","PS06","0","DO Delivery Order","$0.00","Nov 6, 2017",,"4740","PUBLIC BUILDINGS SERVICE","PBS R1 ACQ MANAGEMENT DIVISION","S","Z2AA","REPAIR OR ALTERATION OF OFFICE BUILDINGS","236220","COMMERCIAL AND INSTITUTIONAL BUILDING CONSTRUCTION","WOBURN","MA","018011092",,,"JYEWBM2PC2J5","JYEWBM2PC2J5","CORNERSTONE CONSTRUCTION SERVICES  LLC","CORNERSTONE CONSTRUCTION SERVICES, LLC","4XRZ9",
"GSP0115BZ5016","GS01P13BZD0013","0","0","DO Delivery Order","$197,937.41","Mar 3, 2015",,"4740","PUBLIC BUILDINGS SERVICE","GSA/PBS NEW ENGLAND REGION","S","Z2AA","REPAIR OR ALTERATION OF OFFICE BUILDINGS","236220","COMMERCIAL AND INSTITUTIONAL BUILDING CONSTRUCTION","WOBURN","MA","018011092",,,"JYEWBM2PC2J5","JYEWBM2PC2J5","CORNERSTONE CONSTRUCTION SERVICES  LLC","CORNERSTONE CONSTRUCTION SERVICES, LLC",,
"GSP0117BW0029","GS01P13BZD0013","PS03","0","DO Delivery Order","$0.00","Aug 8, 2017",,"4740","PUBLIC BUILDINGS SERVICE","PBS R1 ACQ MANAGEMENT DIVISION","S","Z2AA","REPAIR OR ALTERATION OF OFFICE BUILDINGS","236220","COMMERCIAL AND INSTITUTIONAL BUILDING CONSTRUCTION","WOBURN","MA","018011092",,,"JYEWBM2PC2J5","JYEWBM2PC2J5","CORNERSTONE CONSTRUCTION SERVICES  LLC","CORNERSTONE CONSTRUCTION SERVICES, LLC","4XRZ9",
"GS01P13BZD0013",,"PS11",0,"IDC Indefinite Delivery Contract","$0.00","Sep 17, 2020",,"4740","PUBLIC BUILDINGS SERVICE","PBS R1 ACQ MANAGEMENT DIVISION","S","Z2AA","REPAIR OR ALTERATION OF OFFICE BUILDINGS","236220","COMMERCIAL AND INSTITUTIONAL BUILDING CONSTRUCTION","WOBURN","MA","018011092",,,"JYEWBM2PC2J5","JYEWBM2PC2J5","CORNERSTONE CONSTRUCTION SERVICES  LLC","CORNERSTONE CONSTRUCTION SERVICES, LLC","4XRZ9",
"GS01P13BZD0013",,"PS04",0,"IDC Indefinite Delivery Contract","$0.00","Jun 4, 2015",,"4740","PUBLIC BUILDINGS SERVICE","GSA/PBS NEW ENGLAND REGION","S","Z2AA","REPAIR OR ALTERATION OF OFFICE BUILDINGS","236220","COMMERCIAL AND INSTITUTIONAL BUILDING CONSTRUCTION","WOBURN","MA","018011092",,,"JYEWBM2PC2J5","JYEWBM2PC2J5","CORNERSTONE CONSTRUCTION SERVICES  LLC","CORNERSTONE CONSTRUCTION SERVICES, LLC",,
"GSP0114BZ5015","GS01P13BZD0013","PS01","0","DO Delivery Order","$9,939.74","Jan 29, 2015",,"4740","PUBLIC BUILDINGS SERVICE","GSA/PBS NEW ENGLAND REGION","S","Z2AA","REPAIR OR ALTERATION OF OFFICE BUILDINGS","236220","COMMERCIAL AND INSTITUTIONAL BUILDING CONSTRUCTION","WOBURN","MA","018011092",,,"JYEWBM2PC2J5","JYEWBM2PC2J5","CORNERSTONE CONSTRUCTION SERVICES  LLC","CORNERSTONE CONSTRUCTION SERVICES, LLC",,
"GSP0115BZ5016","GS01P13BZD0013","PS01","0","DO Delivery Order","$29,910.34","Jun 19, 2015",,"4740","PUBLIC BUILDINGS SERVICE","GSA/PBS NEW ENGLAND REGION","S","Z2AA","REPAIR OR ALTERATION OF OFFICE BUILDINGS","236220","COMMERCIAL AND INSTITUTIONAL BUILDING CONSTRUCTION","WOBURN","MA","018011092",,,"JYEWBM2PC2J5","JYEWBM2PC2J5","CORNERSTONE CONSTRUCTION SERVICES  LLC","CORNERSTONE CONSTRUCTION SERVICES, LLC",,
"GSP0116BW7192","GS01P13BZD0013","PS01","0","DO Delivery Order","$56,399.03","Jul 28, 2016",,"4740","PUBLIC BUILDINGS SERVICE","PBS R1 ACQ MANAGEMENT DIVISION","S","Z2AA","REPAIR OR ALTERATION OF OFFICE BUILDINGS","236220","COMMERCIAL AND INSTITUTIONAL BUILDING CONSTRUCTION","WOBURN","MA","018011092",,,"JYEWBM2PC2J5","JYEWBM2PC2J5","CORNERSTONE CONSTRUCTION SERVICES  LLC","CORNERSTONE CONSTRUCTION SERVICES, LLC",,
"GS01P13BZD0013",,"PO06",0,"IDC Indefinite Delivery Contract","$0.00","Jun 7, 2016",,"4740","PUBLIC BUILDINGS SERVICE","PBS R1 ACQ MANAGEMENT DIVISION","S","Z2AA","REPAIR OR ALTERATION OF OFFICE BUILDINGS","236220","COMMERCIAL AND INSTITUTIONAL BUILDING CONSTRUCTION","WOBURN","MA","018011092",,,"JYEWBM2PC2J5","JYEWBM2PC2J5","CORNERSTONE CONSTRUCTION SERVICES  LLC","CORNERSTONE CONSTRUCTION SERVICES, LLC",,
"GSP0117BW0029","GS01P13BZD0013","PC02","0","DO Delivery Order","$2,500.00","Aug 2, 2017",,"4740","PUBLIC BUILDINGS SERVICE","PBS R1 ACQ MANAGEMENT DIVISION","S","Z2AA","REPAIR OR ALTERATION OF OFFICE BUILDINGS","236220","COMMERCIAL AND INSTITUTIONAL BUILDING CONSTRUCTION","WOBURN","MA","018011092",,,"JYEWBM2PC2J5","JYEWBM2PC2J5","CORNERSTONE CONSTRUCTION SERVICES  LLC","CORNERSTONE CONSTRUCTION SERVICES, LLC","4XRZ9",
"GSP0117BW0029","GS01P13BZD0013","PS14","0","DO Delivery Order","$0.00","Dec 2, 2019",,"4740","PUBLIC BUILDINGS SERVICE","PBS R1 ACQ MANAGEMENT DIVISION","S","Z2AA","REPAIR OR ALTERATION OF OFFICE BUILDINGS","236220","COMMERCIAL AND INSTITUTIONAL BUILDING CONSTRUCTION","WOBURN","MA","018011092",,,"JYEWBM2PC2J5","JYEWBM2PC2J5","CORNERSTONE CONSTRUCTION SERVICES  LLC","CORNERSTONE CONSTRUCTION SERVICES, LLC","4XRZ9",
"GSP0114BZ5015","GS01P13BZD0013","PS05","0","DO Delivery Order","$0.00","Mar 27, 2015",,"4740","PUBLIC BUILDINGS SERVICE","GSA/PBS NEW ENGLAND REGION","S","Z2AA","REPAIR OR ALTERATION OF OFFICE BUILDINGS","236220","COMMERCIAL AND INSTITUTIONAL BUILDING CONSTRUCTION","WOBURN","MA","018011092",,,"JYEWBM2PC2J5","JYEWBM2PC2J5","CORNERSTONE CONSTRUCTION SERVICES  LLC","CORNERSTONE CONSTRUCTION SERVICES, LLC",,
"GSP0115BZ5014","GS01P13BZD0013","0","0","DO Delivery Order","$106,196.14","Mar 3, 2015",,"4740","PUBLIC BUILDINGS SERVICE","GSA/PBS NEW ENGLAND REGION","S","Z2AA","REPAIR OR ALTERATION OF OFFICE BUILDINGS","236220","COMMERCIAL AND INSTITUTIONAL BUILDING CONSTRUCTION","WOBURN","MA","018011092",,,"JYEWBM2PC2J5","JYEWBM2PC2J5","CORNERSTONE CONSTRUCTION SERVICES  LLC","CORNERSTONE CONSTRUCTION SERVICES, LLC",,
"GSP0116BW7205","GS01P13BZD0013","0","0","DO Delivery Order","$1,177,271.70","Jul 13, 2016",,"4740","PUBLIC BUILDINGS SERVICE","PBS R1 ACQ MANAGEMENT DIVISION","S","Z2AA","REPAIR OR ALTERATION OF OFFICE BUILDINGS","236220","COMMERCIAL AND INSTITUTIONAL BUILDING CONSTRUCTION","WOBURN","MA","018011092",,,"JYEWBM2PC2J5","JYEWBM2PC2J5","CORNERSTONE CONSTRUCTION SERVICES  LLC","CORNERSTONE CONSTRUCTION SERVICES, LLC",,
"GSP0116BW7205","GS01P13BZD0013","PS01","0","DO Delivery Order","$65,512.47","Oct 28, 2016",,"4740","PUBLIC BUILDINGS SERVICE","PBS R1 ACQ MANAGEMENT DIVISION","S","Z2AA","REPAIR OR ALTERATION OF OFFICE BUILDINGS","236220","COMMERCIAL AND INSTITUTIONAL BUILDING CONSTRUCTION","WOBURN","MA","018011092",,,"JYEWBM2PC2J5","JYEWBM2PC2J5","CORNERSTONE CONSTRUCTION SERVICES  LLC","CORNERSTONE CONSTRUCTION SERVICES, LLC",,
"GSP0117BW0029","GS01P13BZD0013","0","0","DO Delivery Order","$1,699,570.70","Mar 23, 2017",,"4740","PUBLIC BUILDINGS SERVICE","PBS R1 ACQ MANAGEMENT DIVISION","S","Z2AA","REPAIR OR ALTERATION OF OFFICE BUILDINGS","236220","COMMERCIAL AND INSTITUTIONAL BUILDING CONSTRUCTION","WOBURN","MA","018011092",,,"JYEWBM2PC2J5","JYEWBM2PC2J5","CORNERSTONE CONSTRUCTION SERVICES  LLC","CORNERSTONE CONSTRUCTION SERVICES, LLC","4XRZ9",
"GS01P13BZD0013",,"PO09",0,"IDC Indefinite Delivery Contract","$0.00","Jun 7, 2018",,"4740","PUBLIC BUILDINGS SERVICE","PBS R1 ACQ MANAGEMENT DIVISION","S","Z2AA","REPAIR OR ALTERATION OF OFFICE BUILDINGS","236220","COMMERCIAL AND INSTITUTIONAL BUILDING CONSTRUCTION","WOBURN","MA","018011092",,,"JYEWBM2PC2J5","JYEWBM2PC2J5","CORNERSTONE CONSTRUCTION SERVICES  LLC","CORNERSTONE CONSTRUCTION SERVICES, LLC","4XRZ9",
"GS01P13BZD0013",,"0",0,"IDC Indefinite Delivery Contract","$1,000.00","Jul 8, 2013",,"4740","PUBLIC BUILDINGS SERVICE","GSA/PBS NEW ENGLAND REGION","S","Z2AA","REPAIR OR ALTERATION OF OFFICE BUILDINGS","236220","COMMERCIAL AND INSTITUTIONAL BUILDING CONSTRUCTION","WOBURN","MA","018011092",,,"JYEWBM2PC2J5","JYEWBM2PC2J5","CORNERSTONE CONSTRUCTION SERVICES  LLC","CORNERSTONE CONSTRUCTION SERVICES, LLC",,
"GS01P13BZD0013",,"PO03",0,"IDC Indefinite Delivery Contract","$0.00","Jun 6, 2014",,"4740","PUBLIC BUILDINGS SERVICE","GSA/PBS NEW ENGLAND REGION","S","Z2AA","REPAIR OR ALTERATION OF OFFICE BUILDINGS","236220","COMMERCIAL AND INSTITUTIONAL BUILDING CONSTRUCTION","WOBURN","MA","018011092",,,"JYEWBM2PC2J5","JYEWBM2PC2J5","CORNERSTONE CONSTRUCTION SERVICES  LLC","CORNERSTONE CONSTRUCTION SERVICES, LLC",,
"47PB0017F0013","GS01P13BZD0013","0","0","DO Delivery Order","$148,933.60","Aug 18, 2017",,"4740","PUBLIC BUILDINGS SERVICE","PBS R1 ACQ MANAGEMENT DIVISION","S","Z2AA","REPAIR OR ALTERATION OF OFFICE BUILDINGS","236220","COMMERCIAL AND INSTITUTIONAL BUILDING CONSTRUCTION","WOBURN","MA","018011092",,,"JYEWBM2PC2J5","JYEWBM2PC2J5","CORNERSTONE CONSTRUCTION SERVICES  LLC","CORNERSTONE CONSTRUCTION SERVICES, LLC","4XRZ9",
"GSP0114BZ5015","GS01P13BZD0013","PS03","0","DO Delivery Order","$14,470.15","Feb 19, 2015",,"4740","PUBLIC BUILDINGS SERVICE","GSA/PBS NEW ENGLAND REGION","S","Z2AA","REPAIR OR ALTERATION OF OFFICE BUILDINGS","236220","COMMERCIAL AND INSTITUTIONAL BUILDING CONSTRUCTION","WOBURN","MA","018011092",,,"JYEWBM2PC2J5","JYEWBM2PC2J5","CORNERSTONE CONSTRUCTION SERVICES  LLC","CORNERSTONE CONSTRUCTION SERVICES, LLC",,
"GSP0114BZ5015","GS01P13BZD0013","PS04","0","DO Delivery Order","$0.00","Feb 26, 2015",,"4740","PUBLIC BUILDINGS SERVICE","GSA/PBS NEW ENGLAND REGION","S","Z2AA","REPAIR OR ALTERATION OF OFFICE BUILDINGS","236220","COMMERCIAL AND INSTITUTIONAL BUILDING CONSTRUCTION","WOBURN","MA","018011092",,,"JYEWBM2PC2J5","JYEWBM2PC2J5","CORNERSTONE CONSTRUCTION SERVICES  LLC","CORNERSTONE CONSTRUCTION SERVICES, LLC",,
"GSP0114BZ5015","GS01P13BZD0013","PS06","0","DO Delivery Order","$16,893.76","Jul 20, 2015",,"4740","PUBLIC BUILDINGS SERVICE","GSA/PBS NEW ENGLAND REGION","S","Z2AA","REPAIR OR ALTERATION OF OFFICE BUILDINGS","236220","COMMERCIAL AND INSTITUTIONAL BUILDING CONSTRUCTION","WOBURN","MA","018011092",,,"JYEWBM2PC2J5","JYEWBM2PC2J5","CORNERSTONE CONSTRUCTION SERVICES  LLC","CORNERSTONE CONSTRUCTION SERVICES, LLC",,
"GSP0115BW7096","GS01P13BZD0013","PS05","0","DO Delivery Order","$7,606.37","Feb 18, 2016",,"4740","PUBLIC BUILDINGS SERVICE","GSA/PBS NEW ENGLAND REGION","S","Z2AA","REPAIR OR ALTERATION OF OFFICE BUILDINGS","236220","COMMERCIAL AND INSTITUTIONAL BUILDING CONSTRUCTION","WOBURN","MA","018011092",,,"JYEWBM2PC2J5","JYEWBM2PC2J5","CORNERSTONE CONSTRUCTION SERVICES  LLC","CORNERSTONE CONSTRUCTION SERVICES, LLC",,
"GSP0115BZ5014","GS01P13BZD0013","PS01","0","DO Delivery Order","$0.00","Jul 21, 2015",,"4740","PUBLIC BUILDINGS SERVICE","GSA/PBS NEW ENGLAND REGION","S","Z2AA","REPAIR OR ALTERATION OF OFFICE BUILDINGS","236220","COMMERCIAL AND INSTITUTIONAL BUILDING CONSTRUCTION","WOBURN","MA","018011092",,,"JYEWBM2PC2J5","JYEWBM2PC2J5","CORNERSTONE CONSTRUCTION SERVICES  LLC","CORNERSTONE CONSTRUCTION SERVICES, LLC",,
"GSP0116BW7192","GS01P13BZD0013","PS02","0","DO Delivery Order","$82,185.00","Sep 16, 2016",,"4740","PUBLIC BUILDINGS SERVICE","PBS R1 ACQ MANAGEMENT DIVISION","S","Z2AA","REPAIR OR ALTERATION OF OFFICE BUILDINGS","236220","COMMERCIAL AND INSTITUTIONAL BUILDING CONSTRUCTION","WOBURN","MA","018011092",,,"JYEWBM2PC2J5","JYEWBM2PC2J5","CORNERSTONE CONSTRUCTION SERVICES  LLC","CORNERSTONE CONSTRUCTION SERVICES, LLC",,
"GSP0117BW0029","GS01P13BZD0013","PS01","0","DO Delivery Order","$594,192.88","Jul 7, 2017",,"4740","PUBLIC BUILDINGS SERVICE","PBS R1 ACQ MANAGEMENT DIVISION","S","Z2AA","REPAIR OR ALTERATION OF OFFICE BUILDINGS","236220","COMMERCIAL AND INSTITUTIONAL BUILDING CONSTRUCTION","WOBURN","MA","018011092",,,"JYEWBM2PC2J5","JYEWBM2PC2J5","CORNERSTONE CONSTRUCTION SERVICES  LLC","CORNERSTONE CONSTRUCTION SERVICES, LLC","4XRZ9",
"GSP0117BW0029","GS01P13BZD0013","PS04","0","DO Delivery Order","$89,396.17","Aug 18, 2017",,"4740","PUBLIC BUILDINGS SERVICE","PBS R1 ACQ MANAGEMENT DIVISION","S","Z2AA","REPAIR OR ALTERATION OF OFFICE BUILDINGS","236220","COMMERCIAL AND INSTITUTIONAL BUILDING CONSTRUCTION","WOBURN","MA","018011092",,,"JYEWBM2PC2J5","JYEWBM2PC2J5","CORNERSTONE CONSTRUCTION SERVICES  LLC","CORNERSTONE CONSTRUCTION SERVICES, LLC","4XRZ9",
"GSP0114BZ5006","GS01P13BZD0013","PS02","0","DO Delivery Order","$4,020.72","Jul 15, 2014",,"4740","PUBLIC BUILDINGS SERVICE","GSA/PBS NEW ENGLAND REGION","S","Z2AA","REPAIR OR ALTERATION OF OFFICE BUILDINGS","236220","COMMERCIAL AND INSTITUTIONAL BUILDING CONSTRUCTION","WOBURN","MA","018011092",,,"JYEWBM2PC2J5","JYEWBM2PC2J5","CORNERSTONE CONSTRUCTION SERVICES  LLC","CORNERSTONE CONSTRUCTION SERVICES, LLC",,
"GSP0114BZ5015","GS01P13BZD0013","0","0","DO Delivery Order","$542,949.84","Jul 16, 2014",,"4740","PUBLIC BUILDINGS SERVICE","GSA/PBS NEW ENGLAND REGION","S","Z2AA","REPAIR OR ALTERATION OF OFFICE BUILDINGS","236220","COMMERCIAL AND INSTITUTIONAL BUILDING CONSTRUCTION","WOBURN","MA","018011092",,,"JYEWBM2PC2J5","JYEWBM2PC2J5","CORNERSTONE CONSTRUCTION SERVICES  LLC","CORNERSTONE CONSTRUCTION SERVICES, LLC",,
"GSP0114BZ5015","GS01P13BZD0013","PS02","0","DO Delivery Order","$0.00","Feb 5, 2015",,"4740","PUBLIC BUILDINGS SERVICE","GSA/PBS NEW ENGLAND REGION","S","Z2AA","REPAIR OR ALTERATION OF OFFICE BUILDINGS","236220","COMMERCIAL AND INSTITUTIONAL BUILDING CONSTRUCTION","WOBURN","MA","018011092",,,"JYEWBM2PC2J5","JYEWBM2PC2J5","CORNERSTONE CONSTRUCTION SERVICES  LLC","CORNERSTONE CONSTRUCTION SERVICES, LLC",,
"GSP0115BW7096","GS01P13BZD0013","PS01","0","DO Delivery Order","$14,506.82","Jan 12, 2016",,"4740","PUBLIC BUILDINGS SERVICE","GSA/PBS NEW ENGLAND REGION","S","Z2AA","REPAIR OR ALTERATION OF OFFICE BUILDINGS","236220","COMMERCIAL AND INSTITUTIONAL BUILDING CONSTRUCTION","WOBURN","MA","018011092",,,"JYEWBM2PC2J5","JYEWBM2PC2J5","CORNERSTONE CONSTRUCTION SERVICES  LLC","CORNERSTONE CONSTRUCTION SERVICES, LLC",,
"GSP0116BW7192","GS01P13BZD0013","PA12","0","DO Delivery Order","$0.00","Jul 18, 2019",,"4740","PUBLIC BUILDINGS SERVICE","PBS R1 ACQ MANAGEMENT DIVISION","S","Z2AA","REPAIR OR ALTERATION OF OFFICE BUILDINGS","236220","COMMERCIAL AND INSTITUTIONAL BUILDING CONSTRUCTION","WOBURN","MA","018011092",,,"JYEWBM2PC2J5","JYEWBM2PC2J5","CORNERSTONE CONSTRUCTION SERVICES  LLC","CORNERSTONE CONSTRUCTION SERVICES, LLC","4XRZ9",
"GSP0116BW7192","GS01P13BZD0013","PS13","0","DO Delivery Order","$0.00","Dec 2, 2019",,"4740","PUBLIC BUILDINGS SERVICE","PBS R1 ACQ MANAGEMENT DIVISION","S","Z2AA","REPAIR OR ALTERATION OF OFFICE BUILDINGS","236220","COMMERCIAL AND INSTITUTIONAL BUILDING CONSTRUCTION","WOBURN","MA","018011092",,,"JYEWBM2PC2J5","JYEWBM2PC2J5","CORNERSTONE CONSTRUCTION SERVICES  LLC","CORNERSTONE CONSTRUCTION SERVICES, LLC","4XRZ9",
"GSP0114BZ5006","GS01P13BZD0013","0","0","DO Delivery Order","$593,940.61","Mar 14, 2014",,"4740","PUBLIC BUILDINGS SERVICE","GSA/PBS NEW ENGLAND REGION","S","Z2AA","REPAIR OR ALTERATION OF OFFICE BUILDINGS","236220","COMMERCIAL AND INSTITUTIONAL BUILDING CONSTRUCTION","WOBURN","MA","018011092",,,"JYEWBM2PC2J5","JYEWBM2PC2J5","CORNERSTONE CONSTRUCTION SERVICES  LLC","CORNERSTONE CONSTRUCTION SERVICES, LLC",,
"GSP0114BZ5006","GS01P13BZD0013","PS01","0","DO Delivery Order","$0.00","Jun 26, 2014",,"4740","PUBLIC BUILDINGS SERVICE","GSA/PBS NEW ENGLAND REGION","S","Z2AA","REPAIR OR ALTERATION OF OFFICE BUILDINGS","236220","COMMERCIAL AND INSTITUTIONAL BUILDING CONSTRUCTION","WOBURN","MA","018011092",,,"JYEWBM2PC2J5","JYEWBM2PC2J5","CORNERSTONE CONSTRUCTION SERVICES  LLC","CORNERSTONE CONSTRUCTION SERVICES, LLC",,
"GSP0115BW7096","GS01P13BZD0013","0","0","DO Delivery Order","$364,224.84","Sep 28, 2015",,"4740","PUBLIC BUILDINGS SERVICE","GSA/PBS NEW ENGLAND REGION","S","Z2AA","REPAIR OR ALTERATION OF OFFICE BUILDINGS","236220","COMMERCIAL AND INSTITUTIONAL BUILDING CONSTRUCTION","WOBURN","MA","018011092",,,"JYEWBM2PC2J5","JYEWBM2PC2J5","CORNERSTONE CONSTRUCTION SERVICES  LLC","CORNERSTONE CONSTRUCTION SERVICES, LLC",,
"GSP0116BW7205","GS01P13BZD0013","PS02","0","DO Delivery Order","$21,521.31","Feb 8, 2017",,"4740","PUBLIC BUILDINGS SERVICE","PBS R1 ACQ MANAGEMENT DIVISION","S","Z2AA","REPAIR OR ALTERATION OF OFFICE BUILDINGS","236220","COMMERCIAL AND INSTITUTIONAL BUILDING CONSTRUCTION","WOBURN","MA","018011092",,,"JYEWBM2PC2J5","JYEWBM2PC2J5","CORNERSTONE CONSTRUCTION SERVICES  LLC","CORNERSTONE CONSTRUCTION SERVICES, LLC","4XRZ9",
"GSP0116BW7205","GS01P13BZD0013","PS03","0","DO Delivery Order","$20,465.19","May 9, 2017",,"4740","PUBLIC BUILDINGS SERVICE","PBS R1 ACQ MANAGEMENT DIVISION","S","Z2AA","REPAIR OR ALTERATION OF OFFICE BUILDINGS","236220","COMMERCIAL AND INSTITUTIONAL BUILDING CONSTRUCTION","WOBURN","MA","018011092",,,"JYEWBM2PC2J5","JYEWBM2PC2J5","CORNERSTONE CONSTRUCTION SERVICES  LLC","CORNERSTONE CONSTRUCTION SERVICES, LLC","4XRZ9",
"GSP0117BW0029","GS01P13BZD0013","PA12","0","DO Delivery Order","$0.00","Jul 18, 2019",,"4740","PUBLIC BUILDINGS SERVICE","PBS R1 ACQ MANAGEMENT DIVISION","S","Z2AA","REPAIR OR ALTERATION OF OFFICE BUILDINGS","236220","COMMERCIAL AND INSTITUTIONAL BUILDING CONSTRUCTION","WOBURN","MA","018011092",,,"JYEWBM2PC2J5","JYEWBM2PC2J5","CORNERSTONE CONSTRUCTION SERVICES  LLC","CORNERSTONE CONSTRUCTION SERVICES, LLC","4XRZ9",