Contract ID,Reference IDV,Modification Number,Transaction Number,Award/IDV Type,Action Obligation ($),Date Signed,Solicitation Date,Contracting Agency ID,Contracting Agency,Contracting Office Name,PSC Type,PSC,PSC Description,NAICS,NAICS Description,Entity City,Entity State,Entity ZIP Code,Additional Reporting Code,Additional Reporting Description,Unique Entity ID,Ultimate Parent Unique Entity ID,Ultimate Parent Legal Business Name,Legal Business Name,CAGE Code,
"2031ZA20P00200",,"0","0","PO Purchase Order","$18,383.56","Jan 30, 2020",,"2041","BUREAU OF ENGRAVING AND PRINTING","OFFICE OF THE CHIEF PROCUREMENT OFFICER","P","2590","MISCELLANEOUS VEHICULAR COMPONENTS","336320","MOTOR VEHICLE ELECTRICAL AND ELECTRONIC EQUIPMENT MANUFACTURING","KENVIL","NJ","078472640","NONE","NONE OF THE ABOVE","LZ79JXJQNRG6","LZ79JXJQNRG6","GENERAL SALES ADMINISTRATION  INC","GENERAL SALES ADMINISTRATION, INC","3T5H2",
"2091JB23P00387",,"P00001","0","PO Purchase Order","$0.00","Dec 21, 2023",,"2050","INTERNAL REVENUE SERVICE","WESTERN REGION","P","2590","MISCELLANEOUS VEHICULAR COMPONENTS","336320","MOTOR VEHICLE ELECTRICAL AND ELECTRONIC EQUIPMENT MANUFACTURING","CHESTER","CT","064121036","NONE","NONE OF THE ABOVE","K93HX96LHLE5","K93HX96LHLE5","WHELEN ENGINEERING COMPANY  INC.","WHELEN ENGINEERING COMPANY, INC.","10402",
"TEPA1328546",,"0","0","PO Purchase Order","$36,993.00","Jan 30, 2013",,"2041","BUREAU OF ENGRAVING AND PRINTING","DEPT OF TREAS/BUREAU OF ENGRAV AND PRINT","P","2590","MISCELLANEOUS VEHICULAR COMPONENTS","336320","MOTOR VEHICLE ELECTRICAL AND ELECTRONIC EQUIPMENT MANUFACTURING","KENVIL","NJ","078472640",,,"LZ79JXJQNRG6","LZ79JXJQNRG6","GENERAL SALES ADMINISTRATION  INC","GENERAL SALES ADMINISTRATION, INC",,
"TFSASIG170007",,"0","0","PO Purchase Order","$7,500.00","Aug 8, 2017",,"2036","BUREAU OF THE FISCAL SERVICE","ARC DIV PROC SVCS - SIGTARP","S","N023","INSTALLATION OF EQUIPMENT- GROUND EFFECT VEHICLES, MOTOR VEHICLES, TRAILERS, AND CYCLES","336320","MOTOR VEHICLE ELECTRICAL AND ELECTRONIC EQUIPMENT MANUFACTURING","ONTARIO","CA","917623845",,,"ZD4GMJ2QM5B8","ZD4GMJ2QM5B8","10-8 RETROFIT  INC.","10-8 RETROFIT, INC.","41HY5",
"TFSASIG170008",,"2","0","PO Purchase Order","$5,000.00","Jul 30, 2019",,"2036","BUREAU OF THE FISCAL SERVICE","ARC DIV PROC SVCS - SIGTARP","S","N023","INSTALLATION OF EQUIPMENT- GROUND EFFECT VEHICLES, MOTOR VEHICLES, TRAILERS, AND CYCLES","336320","MOTOR VEHICLE ELECTRICAL AND ELECTRONIC EQUIPMENT MANUFACTURING","ACWORTH","GA","301022082",,,"S2HJSTMGMJ75","S2HJSTMGMJ75","PROLOGIC ITS  LLC","PROLOGIC ITS, LLC","7SYQ9",
"2031ZA18P01099",,"0","0","PO Purchase Order","$2,864.40","Sep 28, 2018",,"2041","BUREAU OF ENGRAVING AND PRINTING","OFFICE OF THE CHIEF PROCUREMENT OFFICER","P","3990","MISCELLANEOUS MATERIALS HANDLING EQUIPMENT","336320","MOTOR VEHICLE ELECTRICAL AND ELECTRONIC EQUIPMENT MANUFACTURING","WHITESTONE","NY","113573701","NONE","NONE OF THE ABOVE","HJG9RK9F6GE4","HJG9RK9F6GE4","P & P DISTRIBUTORS  INC","P & P DISTRIBUTORS, INC.","1Y5V2",
"2043FY19P00339",,"0","0","PO Purchase Order","$163,586.25","Sep 30, 2019",,"2050","INTERNAL REVENUE SERVICE","SOUTHEAST REGION","P","5865","ELECTRONIC COUNTERMEASURES, COUNTER-COUNTERMEASURES AND QUICK REACTION CAPABILITY EQUIPMENT","336320","MOTOR VEHICLE ELECTRICAL AND ELECTRONIC EQUIPMENT MANUFACTURING","NORFOLK","NE","687012897","NONE","NONE OF THE ABOVE","XRT9FXKM4KJ3","XRT9FXKM4KJ3","NANNIES INTERNATIONAL  INC.","LOGISTICS365, INC.","64PD7",
"TIRMS16P00173",,"0","0","PO Purchase Order","$19,303.50","May 11, 2016",,"2050","INTERNAL REVENUE SERVICE","MIDWEST REGION","P","3695","MISCELLANEOUS SPECIAL INDUSTRY MACHINERY","336320","MOTOR VEHICLE ELECTRICAL AND ELECTRONIC EQUIPMENT MANUFACTURING","MASSILLON","OH","446468898",,,"TB2JMXFL4EM1","WP9BA3CXV5G6","A.R.E. ACCESSORIES  LLC","A.R.E. ACCESSORIES, LLC",,
"2031ZA20P00200",,"P00001","0","PO Purchase Order","$553.41","Feb 6, 2020",,"2041","BUREAU OF ENGRAVING AND PRINTING","OFFICE OF THE CHIEF PROCUREMENT OFFICER","P","2590","MISCELLANEOUS VEHICULAR COMPONENTS","336320","MOTOR VEHICLE ELECTRICAL AND ELECTRONIC EQUIPMENT MANUFACTURING","KENVIL","NJ","078472640","NONE","NONE OF THE ABOVE","LZ79JXJQNRG6","LZ79JXJQNRG6","GENERAL SALES ADMINISTRATION  INC","GENERAL SALES ADMINISTRATION, INC","3T5H2",
"2091JE21P00041",,"0","0","PO Purchase Order","$55,186.00","Jul 22, 2021",,"2044","UNITED STATES MINT","US MINT SAN FRANCISCO","P","2520","VEHICULAR POWER TRANSMISSION COMPONENTS","336320","MOTOR VEHICLE ELECTRICAL AND ELECTRONIC EQUIPMENT MANUFACTURING","SOUTH SAN FRANCISCO","CA","940801821","NONE","NONE OF THE ABOVE","FKXBWAHZMAS8","FKXBWAHZMAS8","BBJ ELECTRIC INC","BBJ ELECTRIC INC","91QU0",
"2031ZA18P01103",,"0","0","PO Purchase Order","$552.00","Sep 28, 2018",,"2041","BUREAU OF ENGRAVING AND PRINTING","OFFICE OF THE CHIEF PROCUREMENT OFFICER","P","3990","MISCELLANEOUS MATERIALS HANDLING EQUIPMENT","336320","MOTOR VEHICLE ELECTRICAL AND ELECTRONIC EQUIPMENT MANUFACTURING","BURKE","VA","220152233","NONE","NONE OF THE ABOVE","RZXWHQGXLRP3","RZXWHQGXLRP3","CAPITOL CITY SUPPLY COMPANY  INC.","CAPITOL CITY SUPPLY COMPANY, INC.","011G5",
"TFSASIG170004",,"0","0","PO Purchase Order","$7,500.00","Aug 3, 2017",,"2036","BUREAU OF THE FISCAL SERVICE","ARC DIV PROC SVCS - SIGTARP","S","N023","INSTALLATION OF EQUIPMENT- GROUND EFFECT VEHICLES, MOTOR VEHICLES, TRAILERS, AND CYCLES","336320","MOTOR VEHICLE ELECTRICAL AND ELECTRONIC EQUIPMENT MANUFACTURING","BELMONT","CA","940024048",,,"X9FBU43K4ZS6","X9FBU43K4ZS6","PRIORITY 1 PUBLIC SAFETY EQUIPMENT","PRIORITY 1 PUBLIC SAFETY EQUIPMENT","34EZ0",
"TFSASIG170004",,"1","0","PO Purchase Order","$3,750.00","May 4, 2018",,"2036","BUREAU OF THE FISCAL SERVICE","ARC DIV PROC SVCS - SIGTARP","S","N023","INSTALLATION OF EQUIPMENT- GROUND EFFECT VEHICLES, MOTOR VEHICLES, TRAILERS, AND CYCLES","336320","MOTOR VEHICLE ELECTRICAL AND ELECTRONIC EQUIPMENT MANUFACTURING","BELMONT","CA","940024048",,,"X9FBU43K4ZS6","X9FBU43K4ZS6","PRIORITY 1 PUBLIC SAFETY EQUIPMENT","PRIORITY 1 PUBLIC SAFETY EQUIPMENT","34EZ0",
"TFSASIG170008",,"1","0","PO Purchase Order","$5,000.00","May 4, 2018",,"2036","BUREAU OF THE FISCAL SERVICE","ARC DIV PROC SVCS - SIGTARP","S","N023","INSTALLATION OF EQUIPMENT- GROUND EFFECT VEHICLES, MOTOR VEHICLES, TRAILERS, AND CYCLES","336320","MOTOR VEHICLE ELECTRICAL AND ELECTRONIC EQUIPMENT MANUFACTURING","ACWORTH","GA","301022082",,,"S2HJSTMGMJ75","S2HJSTMGMJ75","PROLOGIC ITS  LLC","PROLOGIC ITS, LLC","7SYQ9",
"TIRNO17P00108",,"1","0","PO Purchase Order","$0.00","Dec 20, 2017",,"2050","INTERNAL REVENUE SERVICE","NATIONAL OFFICE - PROCUREMENT OBO","P","2510","VEHICULAR CAB, BODY, AND FRAME STRUCTURAL COMPONENTS","336320","MOTOR VEHICLE ELECTRICAL AND ELECTRONIC EQUIPMENT MANUFACTURING","AUSTIN","TX","787416831","NONE","NONE OF THE ABOVE","K9UVMNJBFFC7","K9UVMNJBFFC7","FENIEX INDUSTRIES INC","FENIEX INDUSTRIES INC","65RQ2",
"2031ZA19P00260",,"0","0","PO Purchase Order","$8,294.55","Mar 12, 2019",,"2041","BUREAU OF ENGRAVING AND PRINTING","OFFICE OF THE CHIEF PROCUREMENT OFFICER","P","3120","BEARINGS, PLAIN, UNMOUNTED","336320","MOTOR VEHICLE ELECTRICAL AND ELECTRONIC EQUIPMENT MANUFACTURING","LAUSANNE",,"1000","NONE","NONE OF THE ABOVE","TCZFWUA1HE55","TC45HS1KHEG5","KOENIG & BAUER AG","KBA-NOTASYS S.A.","SJ505",
"2091JE21P00041",,"P00001","0","PO Purchase Order","$0.00","Oct 26, 2021",,"2044","UNITED STATES MINT","US MINT SAN FRANCISCO","P","2520","VEHICULAR POWER TRANSMISSION COMPONENTS","336320","MOTOR VEHICLE ELECTRICAL AND ELECTRONIC EQUIPMENT MANUFACTURING","SOUTH SAN FRANCISCO","CA","940801821","NONE","NONE OF THE ABOVE","FKXBWAHZMAS8","FKXBWAHZMAS8","BBJ ELECTRIC INC","BBJ ELECTRIC INC","91QU0",
"TFSASIG170004",,"2","0","PO Purchase Order","$5,000.00","Jul 29, 2019",,"2036","BUREAU OF THE FISCAL SERVICE","ARC DIV PROC SVCS - SIGTARP","S","N023","INSTALLATION OF EQUIPMENT- GROUND EFFECT VEHICLES, MOTOR VEHICLES, TRAILERS, AND CYCLES","336320","MOTOR VEHICLE ELECTRICAL AND ELECTRONIC EQUIPMENT MANUFACTURING","BELMONT","CA","940024048",,,"X9FBU43K4ZS6","X9FBU43K4ZS6","PRIORITY 1 PUBLIC SAFETY EQUIPMENT","PRIORITY 1 PUBLIC SAFETY EQUIPMENT","34EZ0",
"TFSASIG170004",,"3","0","PO Purchase Order","-$16,250.00","Feb 24, 2022",,"2036","BUREAU OF THE FISCAL SERVICE","ARC DIV PROC SVCS - SIGTARP","S","N023","INSTALLATION OF EQUIPMENT- GROUND EFFECT VEHICLES, MOTOR VEHICLES, TRAILERS, AND CYCLES","336320","MOTOR VEHICLE ELECTRICAL AND ELECTRONIC EQUIPMENT MANUFACTURING","BELMONT","CA","940024048",,,"X9FBU43K4ZS6","X9FBU43K4ZS6","PRIORITY 1 PUBLIC SAFETY EQUIPMENT","PRIORITY 1 PUBLIC SAFETY EQUIPMENT","34EZ0",
"TFSASIG170007",,"2","0","PO Purchase Order","$5,000.00","Jul 30, 2019",,"2036","BUREAU OF THE FISCAL SERVICE","ARC DIV PROC SVCS - SIGTARP","S","N023","INSTALLATION OF EQUIPMENT- GROUND EFFECT VEHICLES, MOTOR VEHICLES, TRAILERS, AND CYCLES","336320","MOTOR VEHICLE ELECTRICAL AND ELECTRONIC EQUIPMENT MANUFACTURING","ONTARIO","CA","917623845",,,"ZD4GMJ2QM5B8","ZD4GMJ2QM5B8","10-8 RETROFIT  INC.","10-8 RETROFIT, INC.","41HY5",
"TFSASIG170008",,"4","0","PO Purchase Order","-$14,985.00","Dec 6, 2021",,"2036","BUREAU OF THE FISCAL SERVICE","ARC DIV PROC SVCS - SIGTARP","S","N023","INSTALLATION OF EQUIPMENT- GROUND EFFECT VEHICLES, MOTOR VEHICLES, TRAILERS, AND CYCLES","336320","MOTOR VEHICLE ELECTRICAL AND ELECTRONIC EQUIPMENT MANUFACTURING","ACWORTH","GA","301022082",,,"S2HJSTMGMJ75","S2HJSTMGMJ75","PROLOGIC ITS LLC","PROLOGIC ITS, LLC","7SYQ9",
"2031ZA18P00406",,"0","0","PO Purchase Order","$2,621.30","Mar 8, 2018",,"2041","BUREAU OF ENGRAVING AND PRINTING","OFFICE OF THE CHIEF PROCUREMENT OFFICER","P","5963","ELECTRONIC MODULES","336320","MOTOR VEHICLE ELECTRICAL AND ELECTRONIC EQUIPMENT MANUFACTURING","LAUSANNE",,"1000","NONE","NONE OF THE ABOVE","TCZFWUA1HE55","TC45HS1KHEG5","KOENIG & BAUER AG","KBA-NOTASYS S.A.","SJ505",
"2031ZA18P01027",,"0","0","PO Purchase Order","$3,978.50","Sep 19, 2018",,"2041","BUREAU OF ENGRAVING AND PRINTING","OFFICE OF THE CHIEF PROCUREMENT OFFICER","P","4140","FANS, AIR CIRCULATORS, AND BLOWER EQUIPMENT","336320","MOTOR VEHICLE ELECTRICAL AND ELECTRONIC EQUIPMENT MANUFACTURING","SOUTH PARK","PA","151298572","NONE","NONE OF THE ABOVE","GRV5FH5RPKL3","GRV5FH5RPKL3","UNITED COMMERCIAL SUPPLY LLC","UNITED COMMERCIAL SUPPLY LLC","4EWP0",
"2091JB23P00387",,"0","0","PO Purchase Order","$117,927.72","Jun 29, 2023",,"2050","INTERNAL REVENUE SERVICE","WESTERN REGION","P","2590","MISCELLANEOUS VEHICULAR COMPONENTS","336320","MOTOR VEHICLE ELECTRICAL AND ELECTRONIC EQUIPMENT MANUFACTURING","CHESTER","CT","064121036","NONE","NONE OF THE ABOVE","K93HX96LHLE5","K93HX96LHLE5","WHELEN ENGINEERING COMPANY  INC.","WHELEN ENGINEERING COMPANY, INC.","10402",
"TFSASIG170008",,"0","0","PO Purchase Order","$7,500.00","Jun 20, 2017",,"2036","BUREAU OF THE FISCAL SERVICE","ARC DIV PROC SVCS - SIGTARP","S","N023","INSTALLATION OF EQUIPMENT- GROUND EFFECT VEHICLES, MOTOR VEHICLES, TRAILERS, AND CYCLES","336320","MOTOR VEHICLE ELECTRICAL AND ELECTRONIC EQUIPMENT MANUFACTURING","ACWORTH","GA","301022082",,,"S2HJSTMGMJ75","S2HJSTMGMJ75","PROLOGIC ITS  LLC","PROLOGIC ITS, LLC","7SYQ9",
"2031ZA18P01096",,"0","0","PO Purchase Order","$3,631.10","Sep 28, 2018",,"2041","BUREAU OF ENGRAVING AND PRINTING","OFFICE OF THE CHIEF PROCUREMENT OFFICER","P","3990","MISCELLANEOUS MATERIALS HANDLING EQUIPMENT","336320","MOTOR VEHICLE ELECTRICAL AND ELECTRONIC EQUIPMENT MANUFACTURING","SOUTH PARK","PA","151298572","NONE","NONE OF THE ABOVE","GRV5FH5RPKL3","GRV5FH5RPKL3","UNITED COMMERCIAL SUPPLY LLC","UNITED COMMERCIAL SUPPLY LLC","4EWP0",
"2031ZA19P00274",,"0","0","PO Purchase Order","$1,356.00","Feb 28, 2019",,"2041","BUREAU OF ENGRAVING AND PRINTING","OFFICE OF THE CHIEF PROCUREMENT OFFICER","P","4320","POWER AND HAND PUMPS","336320","MOTOR VEHICLE ELECTRICAL AND ELECTRONIC EQUIPMENT MANUFACTURING","SOUTH PARK","PA","151298572","NONE","NONE OF THE ABOVE","GRV5FH5RPKL3","GRV5FH5RPKL3","UNITED COMMERCIAL SUPPLY LLC","UNITED COMMERCIAL SUPPLY LLC","4EWP0",
"2031ZA19P00852",,"0","0","PO Purchase Order","$29,138.21","Sep 22, 2019",,"2041","BUREAU OF ENGRAVING AND PRINTING","OFFICE OF THE CHIEF PROCUREMENT OFFICER","P","2590","MISCELLANEOUS VEHICULAR COMPONENTS","336320","MOTOR VEHICLE ELECTRICAL AND ELECTRONIC EQUIPMENT MANUFACTURING","WARRENTON","VA","201863346","NONE","NONE OF THE ABOVE","J6WJR8QY8TN6","J6WJR8QY8TN6","SHENANDOAH FLEET MAINTENANCE AND MANAGEMENT  LLC","SHENANDOAH FLEET MAINTENANCE AND MANAGEMENT, LLC","4NET4",
"TEPA1328546",,"M0001","0","PO Purchase Order","$4,000.00","Mar 15, 2013",,"2041","BUREAU OF ENGRAVING AND PRINTING","DEPT OF TREAS/BUREAU OF ENGRAV AND PRINT","P","2590","MISCELLANEOUS VEHICULAR COMPONENTS","336320","MOTOR VEHICLE ELECTRICAL AND ELECTRONIC EQUIPMENT MANUFACTURING","KENVIL","NJ","078472640",,,"LZ79JXJQNRG6","LZ79JXJQNRG6","GENERAL SALES ADMINISTRATION  INC","GENERAL SALES ADMINISTRATION, INC",,
"TFSASIG170007",,"3","0","PO Purchase Order","$5,000.00","Aug 27, 2020",,"2036","BUREAU OF THE FISCAL SERVICE","ARC DIV PROC SVCS - SIGTARP","S","N023","INSTALLATION OF EQUIPMENT- GROUND EFFECT VEHICLES, MOTOR VEHICLES, TRAILERS, AND CYCLES","336320","MOTOR VEHICLE ELECTRICAL AND ELECTRONIC EQUIPMENT MANUFACTURING","ONTARIO","CA","917623845",,,"ZD4GMJ2QM5B8","ZD4GMJ2QM5B8","10-8 RETROFIT  INC.","10-8 RETROFIT, INC.","41HY5",
"TFSASIG170008",,"3","0","PO Purchase Order","$5,000.00","Jul 28, 2020",,"2036","BUREAU OF THE FISCAL SERVICE","ARC DIV PROC SVCS - SIGTARP","S","N023","INSTALLATION OF EQUIPMENT- GROUND EFFECT VEHICLES, MOTOR VEHICLES, TRAILERS, AND CYCLES","336320","MOTOR VEHICLE ELECTRICAL AND ELECTRONIC EQUIPMENT MANUFACTURING","ACWORTH","GA","301022082",,,"S2HJSTMGMJ75","S2HJSTMGMJ75","PROLOGIC ITS  LLC","PROLOGIC ITS, LLC","7SYQ9",
"2091JE21P00041",,"P00002","0","PO Purchase Order","$7,396.00","Oct 29, 2021",,"2044","UNITED STATES MINT","US MINT SAN FRANCISCO","P","2520","VEHICULAR POWER TRANSMISSION COMPONENTS","336320","MOTOR VEHICLE ELECTRICAL AND ELECTRONIC EQUIPMENT MANUFACTURING","SOUTH SAN FRANCISCO","CA","940801821","NONE","NONE OF THE ABOVE","FKXBWAHZMAS8","FKXBWAHZMAS8","BBJ ELECTRIC INC","BBJ ELECTRIC INC","91QU0",
"TFSASIG170007",,"1","0","PO Purchase Order","$5,000.00","May 11, 2018",,"2036","BUREAU OF THE FISCAL SERVICE","ARC DIV PROC SVCS - SIGTARP","S","N023","INSTALLATION OF EQUIPMENT- GROUND EFFECT VEHICLES, MOTOR VEHICLES, TRAILERS, AND CYCLES","336320","MOTOR VEHICLE ELECTRICAL AND ELECTRONIC EQUIPMENT MANUFACTURING","ONTARIO","CA","917623845",,,"ZD4GMJ2QM5B8","ZD4GMJ2QM5B8","10-8 RETROFIT  INC.","10-8 RETROFIT, INC.","41HY5",
"TFSASIG170007",,"4","0","PO Purchase Order","-$21,450.00","Jan 11, 2022",,"2036","BUREAU OF THE FISCAL SERVICE","ARC DIV PROC SVCS - SIGTARP","S","N023","INSTALLATION OF EQUIPMENT- GROUND EFFECT VEHICLES, MOTOR VEHICLES, TRAILERS, AND CYCLES","336320","MOTOR VEHICLE ELECTRICAL AND ELECTRONIC EQUIPMENT MANUFACTURING","ONTARIO","CA","917623845",,,"ZD4GMJ2QM5B8","ZD4GMJ2QM5B8","10-8 RETROFIT  INC.","10-8 RETROFIT, INC.","41HY5",
"TIRNO17P00108",,"0","0","PO Purchase Order","$84,928.69","Sep 28, 2017",,"2050","INTERNAL REVENUE SERVICE","NATIONAL OFFICE - PROCUREMENT OBO","P","2510","VEHICULAR CAB, BODY, AND FRAME STRUCTURAL COMPONENTS","336320","MOTOR VEHICLE ELECTRICAL AND ELECTRONIC EQUIPMENT MANUFACTURING","AUSTIN","TX","787416831","NONE","NONE OF THE ABOVE","K9UVMNJBFFC7","K9UVMNJBFFC7","FENIEX INDUSTRIES INC","FENIEX INDUSTRIES INC","65RQ2",
"TPDSIG130009",,"0","0","PO Purchase Order","$8,951.46","Jul 31, 2013",,"2083","SPECIAL INSPECTOR GENERAL FOR THE TROUBLED ASSET RELIEF PROGRAM","SIGTARP","P","7125","CABINETS, LOCKERS, BINS, AND SHELVING","336320","MOTOR VEHICLE ELECTRICAL AND ELECTRONIC EQUIPMENT MANUFACTURING","ALEXANDRIA","VA","223122357",,,"LVK9CLYD1S36","P9QQX7RT8E98","GOLDBELT  INCORPORATED","GOLDBELT WOLF, LLC",,
